Target
Alpha-2C adrenergic receptor
Ligand
BDBM50203557
Substrate
Meas. Tech.
ChEMBL_454217 (CHEMBL903400)
Ki
9.4±n/a nM
Citation
 Hagihara, KKashima, HIida, KEnokizono, JUchida, SNonaka, HKurokawa, MShimada, J Novel 4-(6,7-dimethoxy-1,2,3,4-tetrahydroisoquinolin-2-yl)methylbenzofuran derivatives as selective alpha(2C)-adrenergic receptor antagonists. Bioorg Med Chem Lett 17:1616-21 (2007)  
Target
Name:
Alpha-2C adrenergic receptor
Synonyms:
ADA2C_HUMAN ADRA2L2 Adrenergic alpha2C Adrenergic receptor alpha Alpha-2 adrenergic receptor subtype C4 Alpha-2C adrenoreceptor | adrenergic, alpha-2C-, receptor [Homo sapiens]
Type:
Enzyme
Mol. Mass.:
49552.32
Organism:
Homo sapiens (Human)
Description:
P18825
Residue:
462
  
Inhibitor
Name:
BDBM50203557
Synonyms:
3-(4-((6,7-dimethoxy-3,4-dihydroisoquinolin-2(1H)-yl)methyl)-7-methoxybenzofuran-2-yl)-N-(2-(dimethylamino)ethyl)benzamide | CHEMBL392771
Type:
Small organic molecule
Emp. Form.:
C32H37N3O5
Mol. Mass.:
543.6533
SMILES:
COc1cc2CCN(Cc3ccc(OC)c4oc(cc34)-c3cccc(c3)C(=O)NCCN(C)C)Cc2cc1OC
: