Target
Thymidine kinase
Ligand
BDBM50206499
Substrate
Meas. Tech.
ChEMBL_454748 (CHEMBL886771)
IC50
>500000±n/a nM
Citation
 Ciliberti, NManfredini, SAngusti, ADurini, ESolaroli, NVertuani, SBuzzoni, LBonache, MCBen-Shalom, EKarlsson, ASaada, ABalzarini, J Novel selective human mitochondrial kinase inhibitors: design, synthesis and enzymatic activity. Bioorg Med Chem 15:3065-81 (2007)  
Target
Name:
Thymidine kinase
Synonyms:
KITH_VZVD | TK
Type:
PROTEIN
Mol. Mass.:
37819.99
Organism:
Varicella-zoster virus (strain Dumas) (HHV-3) (Human herpesvirus 3)
Description:
ChEMBL_444706
Residue:
341
  
Inhibitor
Name:
BDBM50206499
Synonyms:
9-(2'-O-pentanoyl-beta-D-arabinofuranosyl)guanine | CHEMBL401029
Type:
Small organic molecule
Emp. Form.:
C15H21N5O6
Mol. Mass.:
367.3571
SMILES:
CCCCC(=O)O[C@H]1[C@H](O)[C@@H](CO)O[C@H]1n1cnc2c1nc(N)[nH]c2=O
: