Target
Thymidine kinase
Ligand
BDBM50206491
Substrate
Meas. Tech.
ChEMBL_454748 (CHEMBL886771)
IC50
3200±n/a nM
Citation
 Ciliberti, NManfredini, SAngusti, ADurini, ESolaroli, NVertuani, SBuzzoni, LBonache, MCBen-Shalom, EKarlsson, ASaada, ABalzarini, J Novel selective human mitochondrial kinase inhibitors: design, synthesis and enzymatic activity. Bioorg Med Chem 15:3065-81 (2007)  
Target
Name:
Thymidine kinase
Synonyms:
KITH_VZVD | TK
Type:
PROTEIN
Mol. Mass.:
37819.99
Organism:
Varicella-zoster virus (strain Dumas) (HHV-3) (Human herpesvirus 3)
Description:
ChEMBL_444706
Residue:
341
  
Inhibitor
Name:
BDBM50206491
Synonyms:
1-beta-D-arabinofuranosyl-5-(2-bromovinyl)uracil CHEMBL70046 | SORIVUDINE
Type:
Small organic molecule
Emp. Form.:
C11H13BrN2O6
Mol. Mass.:
349.135
SMILES:
OC[C@H]1O[C@H]([C@@H](O)[C@@H]1O)n1cc(C=CBr)c(=O)[nH]c1=O
: