Target
Thymidine kinase
Ligand
BDBM50206504
Substrate
Meas. Tech.
ChEMBL_454748 (CHEMBL886771)
IC50
>500000±n/a nM
Citation
 Ciliberti, NManfredini, SAngusti, ADurini, ESolaroli, NVertuani, SBuzzoni, LBonache, MCBen-Shalom, EKarlsson, ASaada, ABalzarini, J Novel selective human mitochondrial kinase inhibitors: design, synthesis and enzymatic activity. Bioorg Med Chem 15:3065-81 (2007)  
Target
Name:
Thymidine kinase
Synonyms:
KITH_VZVD | TK
Type:
PROTEIN
Mol. Mass.:
37819.99
Organism:
Varicella-zoster virus (strain Dumas) (HHV-3) (Human herpesvirus 3)
Description:
ChEMBL_444706
Residue:
341
  
Inhibitor
Name:
BDBM50206504
Synonyms:
1-(2'-N-nonylcarboxamido-2'-deoxy-beta-D-arabinofuranosyl)thymine | CHEMBL401439
Type:
Small organic molecule
Emp. Form.:
C20H33N3O6
Mol. Mass.:
411.4925
SMILES:
CCCCCCCCCC(=O)N[C@H]1[C@H](O)[C@@H](CO)O[C@H]1n1cc(C)c(=O)[nH]c1=O
: