Target
Thymidine kinase
Ligand
BDBM50100412
Substrate
Meas. Tech.
ChEMBL_454748 (CHEMBL886771)
IC50
>1000000±n/a nM
Citation
 Ciliberti, NManfredini, SAngusti, ADurini, ESolaroli, NVertuani, SBuzzoni, LBonache, MCBen-Shalom, EKarlsson, ASaada, ABalzarini, J Novel selective human mitochondrial kinase inhibitors: design, synthesis and enzymatic activity. Bioorg Med Chem 15:3065-81 (2007)  
Target
Name:
Thymidine kinase
Synonyms:
KITH_VZVD | TK
Type:
PROTEIN
Mol. Mass.:
37819.99
Organism:
Varicella-zoster virus (strain Dumas) (HHV-3) (Human herpesvirus 3)
Description:
ChEMBL_444706
Residue:
341
  
Inhibitor
Name:
BDBM50100412
Synonyms:
BDBM50206505 Dodecanoic acid 4-hydroxy-5-hydroxymethyl-2-(5-methyl-2,4-dioxo-3,4-dihydro-2H-pyrimidin-1-yl)-tetrahydro-furan-3-yl ester
Type:
Small organic molecule
Emp. Form.:
C20H32N2O7
Mol. Mass.:
412.4773
SMILES:
CCCCCCCCCC(=O)O[C@H]1[C@H](O)[C@@H](CO)O[C@H]1n1cc(C)c(=O)[nH]c1=O
: