Target
Thymidine kinase
Ligand
BDBM50206508
Substrate
Meas. Tech.
ChEMBL_454748 (CHEMBL886771)
IC50
268000±n/a nM
Citation
 Ciliberti, NManfredini, SAngusti, ADurini, ESolaroli, NVertuani, SBuzzoni, LBonache, MCBen-Shalom, EKarlsson, ASaada, ABalzarini, J Novel selective human mitochondrial kinase inhibitors: design, synthesis and enzymatic activity. Bioorg Med Chem 15:3065-81 (2007)  
Target
Name:
Thymidine kinase
Synonyms:
KITH_VZVD | TK
Type:
PROTEIN
Mol. Mass.:
37819.99
Organism:
Varicella-zoster virus (strain Dumas) (HHV-3) (Human herpesvirus 3)
Description:
ChEMBL_444706
Residue:
341
  
Inhibitor
Name:
BDBM50206508
Synonyms:
1-(2'-O-phenylacetyl-beta-D-arabinofuranosyl)-5(E)-(2-bromovinyl)uracil | CHEMBL241407
Type:
Small organic molecule
Emp. Form.:
C19H19BrN2O7
Mol. Mass.:
467.267
SMILES:
OC[C@H]1O[C@H]([C@@H](OC(=O)Cc2ccccc2)[C@@H]1O)n1cc(C=CBr)c(=O)[nH]c1=O
: