Target
Thymidine kinase
Ligand
BDBM50087289
Substrate
Meas. Tech.
ChEMBL_454748 (CHEMBL886771)
IC50
>1000000±n/a nM
Citation
 Ciliberti, NManfredini, SAngusti, ADurini, ESolaroli, NVertuani, SBuzzoni, LBonache, MCBen-Shalom, EKarlsson, ASaada, ABalzarini, J Novel selective human mitochondrial kinase inhibitors: design, synthesis and enzymatic activity. Bioorg Med Chem 15:3065-81 (2007)  
Target
Name:
Thymidine kinase
Synonyms:
KITH_VZVD | TK
Type:
PROTEIN
Mol. Mass.:
37819.99
Organism:
Varicella-zoster virus (strain Dumas) (HHV-3) (Human herpesvirus 3)
Description:
ChEMBL_444706
Residue:
341
  
Inhibitor
Name:
BDBM50087289
Synonyms:
1-beta-D-Arabinofuranosylcytosine 4-amino-1-beta-D-arabinofuranosylpyrimidin-2(1H)-one CYTARABINE
Type:
Small organic molecule
Emp. Form.:
C9H13N3O5
Mol. Mass.:
243.2166
SMILES:
Nc1ccn([C@@H]2O[C@H](CO)[C@@H](O)[C@@H]2O)c(=O)n1
: