Target
Thymidine kinase
Ligand
BDBM50100414
Substrate
Meas. Tech.
ChEMBL_454748 (CHEMBL886771)
IC50
>1000000±n/a nM
Citation
 Ciliberti, NManfredini, SAngusti, ADurini, ESolaroli, NVertuani, SBuzzoni, LBonache, MCBen-Shalom, EKarlsson, ASaada, ABalzarini, J Novel selective human mitochondrial kinase inhibitors: design, synthesis and enzymatic activity. Bioorg Med Chem 15:3065-81 (2007)  
Target
Name:
Thymidine kinase
Synonyms:
KITH_VZVD | TK
Type:
PROTEIN
Mol. Mass.:
37819.99
Organism:
Varicella-zoster virus (strain Dumas) (HHV-3) (Human herpesvirus 3)
Description:
ChEMBL_444706
Residue:
341
  
Inhibitor
Name:
BDBM50100414
Synonyms:
1-(4-Hydroxy-5-hydroxymethyl-3-octyloxy-tetrahydro-furan-2-yl)-5-methyl-1H-pyrimidine-2,4-dione CHEMBL400411
Type:
Small organic molecule
Emp. Form.:
C18H30N2O6
Mol. Mass.:
370.4406
SMILES:
CCCCCCCCO[C@H]1[C@H](O)[C@@H](CO)O[C@H]1n1cc(C)c(=O)[nH]c1=O
: