Target
Thymidine kinase
Ligand
BDBM50206507
Substrate
Meas. Tech.
ChEMBL_454748 (CHEMBL886771)
IC50
>500000±n/a nM
Citation
 Ciliberti, NManfredini, SAngusti, ADurini, ESolaroli, NVertuani, SBuzzoni, LBonache, MCBen-Shalom, EKarlsson, ASaada, ABalzarini, J Novel selective human mitochondrial kinase inhibitors: design, synthesis and enzymatic activity. Bioorg Med Chem 15:3065-81 (2007)  
Target
Name:
Thymidine kinase
Synonyms:
KITH_VZVD | TK
Type:
PROTEIN
Mol. Mass.:
37819.99
Organism:
Varicella-zoster virus (strain Dumas) (HHV-3) (Human herpesvirus 3)
Description:
ChEMBL_444706
Residue:
341
  
Inhibitor
Name:
BDBM50206507
Synonyms:
1-[2'-O-(N-Boc-12-aminododecanoyl)-beta-D-arabinofuranosyl]-5(E)-(2-bromovinyl)uracil | CHEMBL400232
Type:
Small organic molecule
Emp. Form.:
C28H44BrN3O9
Mol. Mass.:
646.568
SMILES:
CC(C)(C)OC(=O)NCCCCCCCCCCCC(=O)O[C@H]1[C@H](O)[C@@H](CO)O[C@H]1n1cc(C=CBr)c(=O)[nH]c1=O
: