Target
Thymidine kinase
Ligand
BDBM50206497
Substrate
Meas. Tech.
ChEMBL_454748 (CHEMBL886771)
IC50
3600±n/a nM
Citation
 Ciliberti, NManfredini, SAngusti, ADurini, ESolaroli, NVertuani, SBuzzoni, LBonache, MCBen-Shalom, EKarlsson, ASaada, ABalzarini, J Novel selective human mitochondrial kinase inhibitors: design, synthesis and enzymatic activity. Bioorg Med Chem 15:3065-81 (2007)  
Target
Name:
Thymidine kinase
Synonyms:
KITH_VZVD | TK
Type:
PROTEIN
Mol. Mass.:
37819.99
Organism:
Varicella-zoster virus (strain Dumas) (HHV-3) (Human herpesvirus 3)
Description:
ChEMBL_444706
Residue:
341
  
Inhibitor
Name:
BDBM50206497
Synonyms:
1-[2'-O-(4-aminobutanoyl)-beta-D-arabinofuranosyl]-5(E)-(2-bromovinyl)uracil | CHEMBL400233
Type:
Small organic molecule
Emp. Form.:
C15H20BrN3O7
Mol. Mass.:
434.239
SMILES:
NCCCC(=O)O[C@H]1[C@H](O)[C@@H](CO)O[C@H]1n1cc(C=CBr)c(=O)[nH]c1=O
: