Target
Thymidine kinase
Ligand
BDBM50206495
Substrate
Meas. Tech.
ChEMBL_454748 (CHEMBL886771)
IC50
39000±n/a nM
Citation
 Ciliberti, NManfredini, SAngusti, ADurini, ESolaroli, NVertuani, SBuzzoni, LBonache, MCBen-Shalom, EKarlsson, ASaada, ABalzarini, J Novel selective human mitochondrial kinase inhibitors: design, synthesis and enzymatic activity. Bioorg Med Chem 15:3065-81 (2007)  
Target
Name:
Thymidine kinase
Synonyms:
KITH_VZVD | TK
Type:
PROTEIN
Mol. Mass.:
37819.99
Organism:
Varicella-zoster virus (strain Dumas) (HHV-3) (Human herpesvirus 3)
Description:
ChEMBL_444706
Residue:
341
  
Inhibitor
Name:
BDBM50206495
Synonyms:
1-[2'-O-(4-methoxyphenylacetyl)-beta-D-arabinofuranosyl]-5(E)-(2-bromovinyl)uracil | CHEMBL241408
Type:
Small organic molecule
Emp. Form.:
C20H21BrN2O8
Mol. Mass.:
497.293
SMILES:
COc1ccc(CC(=O)O[C@H]2[C@H](O)[C@@H](CO)O[C@H]2n2cc(C=CBr)c(=O)[nH]c2=O)cc1
: