Target
Thymidine kinase
Ligand
BDBM50206506
Substrate
Meas. Tech.
ChEMBL_454748 (CHEMBL886771)
IC50
>500000±n/a nM
Citation
 Ciliberti, NManfredini, SAngusti, ADurini, ESolaroli, NVertuani, SBuzzoni, LBonache, MCBen-Shalom, EKarlsson, ASaada, ABalzarini, J Novel selective human mitochondrial kinase inhibitors: design, synthesis and enzymatic activity. Bioorg Med Chem 15:3065-81 (2007)  
Target
Name:
Thymidine kinase
Synonyms:
KITH_VZVD | TK
Type:
PROTEIN
Mol. Mass.:
37819.99
Organism:
Varicella-zoster virus (strain Dumas) (HHV-3) (Human herpesvirus 3)
Description:
ChEMBL_444706
Residue:
341
  
Inhibitor
Name:
BDBM50206506
Synonyms:
9-beta-D-arabinofuranosylguanosine | CHEMBL240933
Type:
Small organic molecule
Emp. Form.:
C10H13N5O5
Mol. Mass.:
283.2407
SMILES:
Nc1nc2n(cnc2c(=O)[nH]1)[C@@H]1O[C@H](CO)[C@@H](O)[C@@H]1O
: