Target
Metabotropic glutamate receptor 5
Ligand
BDBM50231755
Substrate
Meas. Tech.
ChEMBL_460662 (CHEMBL926736)
Ki
51±n/a nM
Citation
 Vanejevs, MJatzke, CRenner, SMüller, SHechenberger, MBauer, TKlochkova, APyatkin, IKazyulkin, DAksenova, EShulepin, STimonina, OHaasis, AGutcaits, AParsons, CGKauss, VWeil, T Positive and negative modulation of group I metabotropic glutamate receptors. J Med Chem 51:634-47 (2008)  
Target
Name:
Metabotropic glutamate receptor 5
Synonyms:
GRM5_RAT Grm5 Mglur5 metabotropic glutamate 5/1-C metabotropic glutamate 5a
Type:
Enzyme
Mol. Mass.:
131900.14
Organism:
Rattus norvegicus (Rat)
Description:
P31424
Residue:
1203
  
Inhibitor
Name:
BDBM50231755
Synonyms:
6,6-dimethyl-2-phenylethynyl-7,8-dihydro-6H-quinolin-5-one | CHEMBL253814
Type:
Small organic molecule
Emp. Form.:
C19H17NO
Mol. Mass.:
275.3444
SMILES:
CC1(C)CCc2nc(ccc2C1=O)C#Cc1ccccc1
: