Target
Metabotropic glutamate receptor 5
Ligand
BDBM50231719
Substrate
Meas. Tech.
ChEMBL_460662 (CHEMBL926736)
Ki
7600±n/a nM
Citation
 Vanejevs, MJatzke, CRenner, SMüller, SHechenberger, MBauer, TKlochkova, APyatkin, IKazyulkin, DAksenova, EShulepin, STimonina, OHaasis, AGutcaits, AParsons, CGKauss, VWeil, T Positive and negative modulation of group I metabotropic glutamate receptors. J Med Chem 51:634-47 (2008)  
Target
Name:
Metabotropic glutamate receptor 5
Synonyms:
GRM5_RAT Grm5 Mglur5 metabotropic glutamate 5/1-C metabotropic glutamate 5a
Type:
Enzyme
Mol. Mass.:
131900.14
Organism:
Rattus norvegicus (Rat)
Description:
P31424
Residue:
1203
  
Inhibitor
Name:
BDBM50231719
Synonyms:
2-phenylethynyl-5,6,7,8-tetrahydro-quinolin-5-ol | CHEMBL253157
Type:
Small organic molecule
Emp. Form.:
C17H15NO
Mol. Mass.:
249.3071
SMILES:
OC1CCCc2nc(ccc12)C#Cc1ccccc1
: