Target
Metabotropic glutamate receptor 1
Ligand
BDBM50231730
Substrate
Meas. Tech.
ChEMBL_460661 (CHEMBL926735)
IC50
3000±n/a nM
Citation
 Vanejevs, MJatzke, CRenner, SMüller, SHechenberger, MBauer, TKlochkova, APyatkin, IKazyulkin, DAksenova, EShulepin, STimonina, OHaasis, AGutcaits, AParsons, CGKauss, VWeil, T Positive and negative modulation of group I metabotropic glutamate receptors. J Med Chem 51:634-47 (2008)  
Target
Name:
Metabotropic glutamate receptor 1
Synonyms:
GRM1_RAT Grm1 Metabotropic glutamate receptor Mglur1 metabotropic glutamate 1/5-D metabotropic glutamate receptor 1 isoform alpha precursor
Type:
Enzyme Catalytic Domain
Mol. Mass.:
133240.47
Organism:
RAT
Description:
metabotropic glutamate 1/2 0 RAT::P23385
Residue:
1199
  
Inhibitor
Name:
BDBM50231730
Synonyms:
2-cyclohexylamino-5-oxo-5,6,7,8-tetrahydroquinoline-3-carbonitrile | CHEMBL252736
Type:
Small organic molecule
Emp. Form.:
C16H19N3O
Mol. Mass.:
269.3416
SMILES:
O=C1CCCc2nc(NC3CCCCC3)c(cc12)C#N
: