Target
Metabotropic glutamate receptor 1
Ligand
BDBM50231732
Substrate
Meas. Tech.
ChEMBL_460664 (CHEMBL926738)
IC50
12000±n/a nM
Citation
 Vanejevs, MJatzke, CRenner, SMüller, SHechenberger, MBauer, TKlochkova, APyatkin, IKazyulkin, DAksenova, EShulepin, STimonina, OHaasis, AGutcaits, AParsons, CGKauss, VWeil, T Positive and negative modulation of group I metabotropic glutamate receptors. J Med Chem 51:634-47 (2008)  
Target
Name:
Metabotropic glutamate receptor 1
Synonyms:
GRM1_RAT Grm1 Metabotropic glutamate receptor Mglur1 metabotropic glutamate 1/5-D metabotropic glutamate receptor 1 isoform alpha precursor
Type:
Enzyme Catalytic Domain
Mol. Mass.:
133240.47
Organism:
RAT
Description:
metabotropic glutamate 1/2 0 RAT::P23385
Residue:
1199
  
Inhibitor
Name:
BDBM50231732
Synonyms:
7,7-dimethyl-3-nitro-2-(4-phenyl-3,6-dihydro-2H-pyridin-1-yl)-7,8-dihydro-6H-quinolin-5-one | CHEMBL252543
Type:
Small organic molecule
Emp. Form.:
C23H24FN3O3
Mol. Mass.:
409.4534
SMILES:
CC1(C)CC(=O)c2cc(c(NC3CCC(=CC3)c3ccc(F)cc3)nc2C1)[N+]([O-])=O
: