Target
Metabotropic glutamate receptor 1
Ligand
BDBM50231735
Substrate
Meas. Tech.
ChEMBL_460661 (CHEMBL926735)
IC50
1900±n/a nM
Citation
 Vanejevs, MJatzke, CRenner, SMüller, SHechenberger, MBauer, TKlochkova, APyatkin, IKazyulkin, DAksenova, EShulepin, STimonina, OHaasis, AGutcaits, AParsons, CGKauss, VWeil, T Positive and negative modulation of group I metabotropic glutamate receptors. J Med Chem 51:634-47 (2008)  
Target
Name:
Metabotropic glutamate receptor 1
Synonyms:
GRM1_RAT Grm1 Metabotropic glutamate receptor Mglur1 metabotropic glutamate 1/5-D metabotropic glutamate receptor 1 isoform alpha precursor
Type:
Enzyme Catalytic Domain
Mol. Mass.:
133240.47
Organism:
RAT
Description:
metabotropic glutamate 1/2 0 RAT::P23385
Residue:
1199
  
Inhibitor
Name:
BDBM50231735
Synonyms:
2-(indan-2-ylamino)-7,7-dimethyl-5-oxo-5,6,7,8-tetrahydroquinoline-3-carbonitrile | CHEMBL252941
Type:
Small organic molecule
Emp. Form.:
C21H21N3O
Mol. Mass.:
331.4109
SMILES:
CC1(C)CC(=O)c2cc(C#N)c(NC3Cc4ccccc4C3)nc2C1
: