Target
Metabotropic glutamate receptor 5
Ligand
BDBM50231729
Substrate
Meas. Tech.
ChEMBL_460662 (CHEMBL926736)
IC50
8100±n/a nM
Citation
 Vanejevs, MJatzke, CRenner, SMüller, SHechenberger, MBauer, TKlochkova, APyatkin, IKazyulkin, DAksenova, EShulepin, STimonina, OHaasis, AGutcaits, AParsons, CGKauss, VWeil, T Positive and negative modulation of group I metabotropic glutamate receptors. J Med Chem 51:634-47 (2008)  
Target
Name:
Metabotropic glutamate receptor 5
Synonyms:
GRM5_RAT Grm5 Mglur5 metabotropic glutamate 5/1-C metabotropic glutamate 5a
Type:
Enzyme
Mol. Mass.:
131900.14
Organism:
Rattus norvegicus (Rat)
Description:
P31424
Residue:
1203
  
Inhibitor
Name:
BDBM50231729
Synonyms:
2-benzylamino-7,7-dimethyl-7,8-dihydro-6H-quinolin-5-one | CHEMBL252735
Type:
Small organic molecule
Emp. Form.:
C18H20N2O
Mol. Mass.:
280.3642
SMILES:
CC1(C)CC(=O)c2ccc(NCc3ccccc3)nc2C1
: