Target
Metabotropic glutamate receptor 5
Ligand
BDBM50231738
Substrate
Meas. Tech.
ChEMBL_460662 (CHEMBL926736)
Ki
210±n/a nM
Citation
 Vanejevs, MJatzke, CRenner, SMüller, SHechenberger, MBauer, TKlochkova, APyatkin, IKazyulkin, DAksenova, EShulepin, STimonina, OHaasis, AGutcaits, AParsons, CGKauss, VWeil, T Positive and negative modulation of group I metabotropic glutamate receptors. J Med Chem 51:634-47 (2008)  
Target
Name:
Metabotropic glutamate receptor 5
Synonyms:
GRM5_RAT Grm5 Mglur5 metabotropic glutamate 5/1-C metabotropic glutamate 5a
Type:
Enzyme
Mol. Mass.:
131900.14
Organism:
Rattus norvegicus (Rat)
Description:
P31424
Residue:
1203
  
Inhibitor
Name:
BDBM50231738
Synonyms:
7,7-dimethyl-2-pyridin-2-ylethynyl-7,8-dihydro-6H-quinolin-5-one | CHEMBL400367
Type:
Small organic molecule
Emp. Form.:
C18H16N2O
Mol. Mass.:
276.3324
SMILES:
CC1(C)CC(=O)c2ccc(nc2C1)C#Cc1ccccn1
: