Target
Metabotropic glutamate receptor 1
Ligand
BDBM50231725
Substrate
Meas. Tech.
ChEMBL_460664 (CHEMBL926738)
IC50
21000±n/a nM
Citation
 Vanejevs, MJatzke, CRenner, SMüller, SHechenberger, MBauer, TKlochkova, APyatkin, IKazyulkin, DAksenova, EShulepin, STimonina, OHaasis, AGutcaits, AParsons, CGKauss, VWeil, T Positive and negative modulation of group I metabotropic glutamate receptors. J Med Chem 51:634-47 (2008)  
Target
Name:
Metabotropic glutamate receptor 1
Synonyms:
GRM1_RAT Grm1 Metabotropic glutamate receptor Mglur1 metabotropic glutamate 1/5-D metabotropic glutamate receptor 1 isoform alpha precursor
Type:
Enzyme Catalytic Domain
Mol. Mass.:
133240.47
Organism:
RAT
Description:
metabotropic glutamate 1/2 0 RAT::P23385
Residue:
1199
  
Inhibitor
Name:
BDBM50231725
Synonyms:
2-cyclopentylamino-7,7-dimethyl-5-oxo-5,6,7,8-tetrahydroquinoline-3-carboxylic acid dimethylamide | CHEMBL254429
Type:
Small organic molecule
Emp. Form.:
C19H27N3O2
Mol. Mass.:
329.4366
SMILES:
CN(C)C(=O)c1cc2C(=O)CC(C)(C)Cc2nc1NC1CCCC1
: