Target
Metabotropic glutamate receptor 1
Ligand
BDBM50231749
Substrate
Meas. Tech.
ChEMBL_460661 (CHEMBL926735)
IC50
6±n/a nM
Citation
 Vanejevs, MJatzke, CRenner, SMüller, SHechenberger, MBauer, TKlochkova, APyatkin, IKazyulkin, DAksenova, EShulepin, STimonina, OHaasis, AGutcaits, AParsons, CGKauss, VWeil, T Positive and negative modulation of group I metabotropic glutamate receptors. J Med Chem 51:634-47 (2008)  
Target
Name:
Metabotropic glutamate receptor 1
Synonyms:
GRM1_RAT Grm1 Metabotropic glutamate receptor Mglur1 metabotropic glutamate 1/5-D metabotropic glutamate receptor 1 isoform alpha precursor
Type:
Enzyme Catalytic Domain
Mol. Mass.:
133240.47
Organism:
RAT
Description:
metabotropic glutamate 1/2 0 RAT::P23385
Residue:
1199
  
Inhibitor
Name:
BDBM50231749
Synonyms:
6-ethyl-5-methyl-3-(1,2,4,5-tetrahydrobenzo[d]azepin-3-yl)pyrazine-2-carbonitrile | CHEMBL253142
Type:
Small organic molecule
Emp. Form.:
C18H20N4
Mol. Mass.:
292.3782
SMILES:
CCc1nc(C#N)c(nc1C)N1CCc2ccccc2CC1
: