Target
Metabotropic glutamate receptor 1
Ligand
BDBM50231765
Substrate
Meas. Tech.
ChEMBL_460664 (CHEMBL926738)
IC50
13000±n/a nM
Citation
 Vanejevs, MJatzke, CRenner, SMüller, SHechenberger, MBauer, TKlochkova, APyatkin, IKazyulkin, DAksenova, EShulepin, STimonina, OHaasis, AGutcaits, AParsons, CGKauss, VWeil, T Positive and negative modulation of group I metabotropic glutamate receptors. J Med Chem 51:634-47 (2008)  
Target
Name:
Metabotropic glutamate receptor 1
Synonyms:
GRM1_RAT Grm1 Metabotropic glutamate receptor Mglur1 metabotropic glutamate 1/5-D metabotropic glutamate receptor 1 isoform alpha precursor
Type:
Enzyme Catalytic Domain
Mol. Mass.:
133240.47
Organism:
RAT
Description:
metabotropic glutamate 1/2 0 RAT::P23385
Residue:
1199
  
Inhibitor
Name:
BDBM50231765
Synonyms:
2-(cyclopentylamino)-7,7-dimethyl-3-(2H-tetrazol-5-yl)-7,8-dihydroquinolin-5(6H)-one | CHEMBL400505
Type:
Small organic molecule
Emp. Form.:
C17H22N6O
Mol. Mass.:
326.3962
SMILES:
CC1(C)CC(=O)c2cc(-c3nnn[nH]3)c(NC3CCCC3)nc2C1
: