Target
Metabotropic glutamate receptor 1
Ligand
BDBM50231766
Substrate
Meas. Tech.
ChEMBL_460664 (CHEMBL926738)
IC50
15000±n/a nM
Citation
 Vanejevs, MJatzke, CRenner, SMüller, SHechenberger, MBauer, TKlochkova, APyatkin, IKazyulkin, DAksenova, EShulepin, STimonina, OHaasis, AGutcaits, AParsons, CGKauss, VWeil, T Positive and negative modulation of group I metabotropic glutamate receptors. J Med Chem 51:634-47 (2008)  
Target
Name:
Metabotropic glutamate receptor 1
Synonyms:
GRM1_RAT Grm1 Metabotropic glutamate receptor Mglur1 metabotropic glutamate 1/5-D metabotropic glutamate receptor 1 isoform alpha precursor
Type:
Enzyme Catalytic Domain
Mol. Mass.:
133240.47
Organism:
RAT
Description:
metabotropic glutamate 1/2 0 RAT::P23385
Residue:
1199
  
Inhibitor
Name:
BDBM50231766
Synonyms:
2-[4-(4-fluoro-phenyl)-3,6-dihydro-2H-pyridin-1-yl]-7,7-dimethyl-3-morpholin-4-yl-7,8-dihydro-6H-quinolin-5-one | CHEMBL429122
Type:
Small organic molecule
Emp. Form.:
C26H30FN3O2
Mol. Mass.:
435.5337
SMILES:
CC1(C)CC(=O)c2cc(N3CCOCC3)c(nc2C1)N1CCC(=CC1)c1ccc(F)cc1
: