Target
Coagulation factor X
Ligand
BDBM12693
Substrate
Meas. Tech.
ChEMBL_461701 (CHEMBL927722)
Ki
0.03±n/a nM
Citation
 Varnes, JGWacker, DAPinto, DJOrwat, MJTheroff, JPWells, BGalemo, RALuettgen, JMKnabb, RMBai, SHe, KLam, PYWexler, RR Structure-activity relationship and pharmacokinetic profile of 5-ketopyrazole factor Xa inhibitors. Bioorg Med Chem Lett 18:749-54 (2008)  
Target
Name:
Coagulation factor X
Synonyms:
Activated coagulation factor X (FXa) Coagulation factor X precursor F10 Factor X heavy chain Factor Xa Stuart-Prower factor
Type:
Enzyme
Mol. Mass.:
54726.60
Organism:
Homo sapiens (Human)
Description:
Residue:
488
  
Inhibitor
Name:
BDBM12693
Synonyms:
1-(3-amino-1,2-benzoxazol-5-yl)-6-[4-(2-{[(3R)-3-hydroxypyrrolidin-1-yl]methyl}phenyl)phenyl]-3-(trifluoromethyl)-1H,4H,5H,6H,7H-pyrazolo[3,4-c]pyridin-7-one | BMS-740808
Type:
Small organic molecule
Emp. Form.:
C31H27F3N6O3
Mol. Mass.:
588.5797
SMILES:
Nc1noc2ccc(cc12)-n1nc(c2CCN(C(=O)c12)c1ccc(cc1)-c1ccccc1CN1CC[C@@H](O)C1)C(F)(F)F
: