Target
Cathepsin K
Ligand
BDBM19489
Substrate
Meas. Tech.
ChEMBL_462255 (CHEMBL945089)
IC50
0.8±n/a nM
Citation
 Gauthier, JYChauret, NCromlish, WDesmarais, SDuong, le TFalgueyret, JPKimmel, DBLamontagne, SLéger, SLeRiche, TLi, CSMassé, FMcKay, DJNicoll-Griffith, DAOballa, RMPalmer, JTPercival, MDRiendeau, DRobichaud, JRodan, GARodan, SBSeto, CThérien, MTruong, VLVenuti, MCWesolowski, GYoung, RNZamboni, RBlack, WC The discovery of odanacatib (MK-0822), a selective inhibitor of cathepsin K. Bioorg Med Chem Lett 18:923-8 (2008)  
Target
Name:
Cathepsin K
Synonyms:
CATK_RABIT | CTSK
Type:
Enzyme
Mol. Mass.:
36879.51
Organism:
Oryctolagus cuniculus (rabbit)
Description:
Residue:
329
  
Inhibitor
Name:
BDBM19489
Synonyms:
(2S)-N-(cyanomethyl)-4-methyl-2-[[(1S)-2,2,2-trifluoro-1-[4-(4-methylsulfon CHEMBL437501 | L-873724
Type:
Small organic molecule
Emp. Form.:
C23H26F3N3O3S
Mol. Mass.:
481.531
SMILES:
CC(C)C[C@H](N[C@@H](c1ccc(cc1)-c1ccc(cc1)S(C)(=O)=O)C(F)(F)F)C(=O)NCC#N
: