Target
Cathepsin K
Ligand
BDBM50233031
Substrate
Meas. Tech.
ChEMBL_462245 (CHEMBL945079)
IC50
1.5±n/a nM
Citation
 Gauthier, JYChauret, NCromlish, WDesmarais, SDuong, le TFalgueyret, JPKimmel, DBLamontagne, SLéger, SLeRiche, TLi, CSMassé, FMcKay, DJNicoll-Griffith, DAOballa, RMPalmer, JTPercival, MDRiendeau, DRobichaud, JRodan, GARodan, SBSeto, CThérien, MTruong, VLVenuti, MCWesolowski, GYoung, RNZamboni, RBlack, WC The discovery of odanacatib (MK-0822), a selective inhibitor of cathepsin K. Bioorg Med Chem Lett 18:923-8 (2008)  
Target
Name:
Cathepsin K
Synonyms:
CATK_HUMAN CTSO Cathepsin O Cathepsin X
Type:
Enzyme
Mol. Mass.:
36975.68
Organism:
Homo sapiens (Human)
Description:
P43235
Residue:
329
  
Inhibitor
Name:
BDBM50233031
Synonyms:
(S)-n-(cyano-dicyclopropyl-methyl)-4,4,4-trifluoro-2-[(S)-2,2,2-trifluoro-1-(4'-methanesulfonyl-biphenyl-4-yl)-ethylamino]-butyramide | CHEMBL252784
Type:
Small organic molecule
Emp. Form.:
C27H27F6N3O3S
Mol. Mass.:
587.577
SMILES:
CS(=O)(=O)c1ccc(cc1)-c1ccc(cc1)[C@H](N[C@@H](CC(F)(F)F)C(=O)NC(C#N)(C1CC1)C1CC1)C(F)(F)F
: