Target
Cathepsin K
Ligand
BDBM19778
Substrate
Meas. Tech.
ChEMBL_462255 (CHEMBL945089)
IC50
0.5±n/a nM
Citation
 Gauthier, JYChauret, NCromlish, WDesmarais, SDuong, le TFalgueyret, JPKimmel, DBLamontagne, SLéger, SLeRiche, TLi, CSMassé, FMcKay, DJNicoll-Griffith, DAOballa, RMPalmer, JTPercival, MDRiendeau, DRobichaud, JRodan, GARodan, SBSeto, CThérien, MTruong, VLVenuti, MCWesolowski, GYoung, RNZamboni, RBlack, WC The discovery of odanacatib (MK-0822), a selective inhibitor of cathepsin K. Bioorg Med Chem Lett 18:923-8 (2008)  
Target
Name:
Cathepsin K
Synonyms:
CATK_RABIT | CTSK
Type:
Enzyme
Mol. Mass.:
36879.51
Organism:
Oryctolagus cuniculus (rabbit)
Description:
Residue:
329
  
Inhibitor
Name:
BDBM19778
Synonyms:
(2S)-2-(1-benzofuran-2-ylformamido)-4-methyl-N-[(4S,7R)-7-methyl-3-oxo-1-(pyridine-2-sulfonyl)azepan-4-yl]pentanamide CHEMBL203665
Type:
Small organic molecule
Emp. Form.:
C27H32N4O6S
Mol. Mass.:
540.631
SMILES:
CC(C)C[C@H](NC(=O)c1cc2ccccc2o1)C(=O)N[C@H]1CC[C@@H](C)N(CC1=O)S(=O)(=O)c1ccccn1
: