Target
C-X-C chemokine receptor type 2
Ligand
BDBM50236295
Substrate
Meas. Tech.
ChEMBL_462972 (CHEMBL928890)
IC50
1300±n/a nM
Citation
 Winters, MPCrysler, CSubasinghe, NRyan, DLeong, LZhao, SDonatelli, RYurkow, EMazzulla, MBoczon, LManthey, CLMolloy, CRaymond, HMurray, LMcAlonan, LTomczuk, B Carboxylic acid bioisosteres acylsulfonamides, acylsulfamides, and sulfonylureas as novel antagonists of the CXCR2 receptor. Bioorg Med Chem Lett 18:1926-30 (2008)  
Target
Name:
C-X-C chemokine receptor type 2
Synonyms:
CD_antigen=CD182 CXCR-2 CXCR2_RABIT High affinity interleukin-8 receptor B IL8RB
Type:
PROTEIN
Mol. Mass.:
40639.60
Organism:
Oryctolagus cuniculus
Description:
ChEMBL_462972
Residue:
358
  
Inhibitor
Name:
BDBM50236295
Synonyms:
4-[5-cyano-2-(4-fluorophenyl)-1H-indol-3-yl]-N-[(methylamino)sulfonyl]butanamide | CHEMBL257829
Type:
Small organic molecule
Emp. Form.:
C20H19FN4O3S
Mol. Mass.:
414.453
SMILES:
CNS(=O)(=O)NC(=O)CCCc1c([nH]c2ccc(cc12)C#N)-c1ccc(F)cc1
: