Target
Falcipain 2
Ligand
BDBM50371561
Substrate
Meas. Tech.
ChEMBL_463775 (CHEMBL931126)
Ki
53±n/a nM
Citation
 Ettari, RNizi, EDi Francesco, MEDude, MAPradel, GVicík, RSchirmeister, TMicale, NGrasso, SZappalà, M Development of peptidomimetics with a vinyl sulfone warhead as irreversible falcipain-2 inhibitors. J Med Chem 51:988-96 (2008)  
Target
Name:
Falcipain 2
Synonyms:
Cysteine protease falcipain-2 Falcipain-2
Type:
Enzyme
Mol. Mass.:
55912.60
Organism:
Plasmodium falciparum
Description:
Recombinant falcipain-2.
Residue:
484
  
Inhibitor
Name:
BDBM50371561
Synonyms:
CHEMBL405741
Type:
Small organic molecule
Emp. Form.:
C44H38ClF3N4O7S
Mol. Mass.:
859.308
SMILES:
COc1ccc(cc1)S(=O)(=O)C=C[C@H](CCc1ccccc1)NC(=O)CN1c2ccccc2C(=N[C@H](COC(=O)Nc2ccc(Cl)cc2C(F)(F)F)C1=O)c1ccccc1
: