Target
Falcipain 2
Ligand
BDBM50371566
Substrate
Meas. Tech.
ChEMBL_463775 (CHEMBL931126)
Ki
370±n/a nM
Citation
 Ettari, RNizi, EDi Francesco, MEDude, MAPradel, GVicík, RSchirmeister, TMicale, NGrasso, SZappalà, M Development of peptidomimetics with a vinyl sulfone warhead as irreversible falcipain-2 inhibitors. J Med Chem 51:988-96 (2008)  
Target
Name:
Falcipain 2
Synonyms:
Cysteine protease falcipain-2 Falcipain-2
Type:
Enzyme
Mol. Mass.:
55912.60
Organism:
Plasmodium falciparum
Description:
Recombinant falcipain-2.
Residue:
484
  
Inhibitor
Name:
BDBM50371566
Synonyms:
CHEMBL407354
Type:
Small organic molecule
Emp. Form.:
C30H26ClF3N4O6S
Mol. Mass.:
663.064
SMILES:
CS(=O)(=O)C=CCNC(=O)CN1c2ccccc2C(=N[C@H](COC(=O)Nc2ccc(Cl)cc2C(F)(F)F)C1=O)c1ccccc1
: