Target
Falcipain 2
Ligand
BDBM50157741
Substrate
Meas. Tech.
ChEMBL_463775 (CHEMBL931126)
Ki
290±n/a nM
Citation
 Ettari, RNizi, EDi Francesco, MEDude, MAPradel, GVicík, RSchirmeister, TMicale, NGrasso, SZappalà, M Development of peptidomimetics with a vinyl sulfone warhead as irreversible falcipain-2 inhibitors. J Med Chem 51:988-96 (2008)  
Target
Name:
Falcipain 2
Synonyms:
Cysteine protease falcipain-2 Falcipain-2
Type:
Enzyme
Mol. Mass.:
55912.60
Organism:
Plasmodium falciparum
Description:
Recombinant falcipain-2.
Residue:
484
  
Inhibitor
Name:
BDBM50157741
Synonyms:
CHEMBL374508 E64
Type:
Small organic molecule
Emp. Form.:
C15H27N5O5
Mol. Mass.:
357.4054
SMILES:
[#6]-[#6](-[#6])-[#6]-[#6@H](-[#7]-[#6](=O)-[#6@H]-1-[#8]-[#6@@H]-1-[#6](-[#8])=O)-[#6](=O)-[#7]-[#6]-[#6]-[#6]-[#6]\[#7]=[#6](/[#7])-[#7]
: