Target
Liver carboxylesterase
Ligand
BDBM50371959
Substrate
Meas. Tech.
ChEMBL_464379 (CHEMBL931028)
IC50
25±n/a nM
Citation
 Wheelock, CENishi, KYing, AJones, PDColvin, MEOlmstead, MMHammock, BD Influence of sulfur oxidation state and steric bulk upon trifluoromethyl ketone (TFK) binding kinetics to carboxylesterases and fatty acid amide hydrolase (FAAH). Bioorg Med Chem 16:2114-30 (2008)  
Target
Name:
Liver carboxylesterase
Synonyms:
Carboxylesterase | EST1_PIG
Type:
PROTEIN
Mol. Mass.:
62009.98
Organism:
Sus scrofa
Description:
ChEMBL_427761
Residue:
566
  
Inhibitor
Name:
BDBM50371959
Synonyms:
CHEMBL86668
Type:
Small organic molecule
Emp. Form.:
C12H21F3O
Mol. Mass.:
238.2897
SMILES:
CCCCCCCCCCC(=O)C(F)(F)F
: