Target
Liver carboxylesterase
Ligand
BDBM50371968
Substrate
Meas. Tech.
ChEMBL_464380 (CHEMBL931029)
IC50
8.6±n/a nM
Citation
 Wheelock, CENishi, KYing, AJones, PDColvin, MEOlmstead, MMHammock, BD Influence of sulfur oxidation state and steric bulk upon trifluoromethyl ketone (TFK) binding kinetics to carboxylesterases and fatty acid amide hydrolase (FAAH). Bioorg Med Chem 16:2114-30 (2008)  
Target
Name:
Liver carboxylesterase
Synonyms:
Carboxylesterase | EST1_PIG
Type:
PROTEIN
Mol. Mass.:
62009.98
Organism:
Sus scrofa
Description:
ChEMBL_427761
Residue:
566
  
Inhibitor
Name:
BDBM50371968
Synonyms:
CHEMBL273138
Type:
Small organic molecule
Emp. Form.:
C15H27F3O2S
Mol. Mass.:
328.434
SMILES:
CCCCCCCCCCCCS(=O)CC(=O)C(F)(F)F
: