Target
Liver carboxylesterase
Ligand
BDBM50371967
Substrate
Meas. Tech.
ChEMBL_464379 (CHEMBL931028)
IC50
37±n/a nM
Citation
 Wheelock, CENishi, KYing, AJones, PDColvin, MEOlmstead, MMHammock, BD Influence of sulfur oxidation state and steric bulk upon trifluoromethyl ketone (TFK) binding kinetics to carboxylesterases and fatty acid amide hydrolase (FAAH). Bioorg Med Chem 16:2114-30 (2008)  
Target
Name:
Liver carboxylesterase
Synonyms:
Carboxylesterase | EST1_PIG
Type:
PROTEIN
Mol. Mass.:
62009.98
Organism:
Sus scrofa
Description:
ChEMBL_427761
Residue:
566
  
Inhibitor
Name:
BDBM50371967
Synonyms:
CHEMBL257071
Type:
Small organic molecule
Emp. Form.:
C15H27F3O3S
Mol. Mass.:
344.433
SMILES:
CCCCCCCCCCCCS(=O)(=O)CC(=O)C(F)(F)F
: