Target
Liver carboxylesterase
Ligand
BDBM50371972
Substrate
Meas. Tech.
ChEMBL_464380 (CHEMBL931029)
IC50
5.3±n/a nM
Citation
 Wheelock, CENishi, KYing, AJones, PDColvin, MEOlmstead, MMHammock, BD Influence of sulfur oxidation state and steric bulk upon trifluoromethyl ketone (TFK) binding kinetics to carboxylesterases and fatty acid amide hydrolase (FAAH). Bioorg Med Chem 16:2114-30 (2008)  
Target
Name:
Liver carboxylesterase
Synonyms:
Carboxylesterase | EST1_PIG
Type:
PROTEIN
Mol. Mass.:
62009.98
Organism:
Sus scrofa
Description:
ChEMBL_427761
Residue:
566
  
Inhibitor
Name:
BDBM50371972
Synonyms:
CHEMBL270375
Type:
Small organic molecule
Emp. Form.:
C15H27F3OS
Mol. Mass.:
312.434
SMILES:
CCCCCCCCCCCCSCC(=O)C(F)(F)F
: