Target
Liver carboxylesterase
Ligand
BDBM50371969
Substrate
Meas. Tech.
ChEMBL_464380 (CHEMBL931029)
IC50
1.3±n/a nM
Citation
 Wheelock, CENishi, KYing, AJones, PDColvin, MEOlmstead, MMHammock, BD Influence of sulfur oxidation state and steric bulk upon trifluoromethyl ketone (TFK) binding kinetics to carboxylesterases and fatty acid amide hydrolase (FAAH). Bioorg Med Chem 16:2114-30 (2008)  
Target
Name:
Liver carboxylesterase
Synonyms:
Carboxylesterase | EST1_PIG
Type:
PROTEIN
Mol. Mass.:
62009.98
Organism:
Sus scrofa
Description:
ChEMBL_427761
Residue:
566
  
Inhibitor
Name:
BDBM50371969
Synonyms:
CHEMBL270374
Type:
Small organic molecule
Emp. Form.:
C13H23F3OS
Mol. Mass.:
284.381
SMILES:
CCCCCCCCCCSCC(=O)C(F)(F)F
: