Target
Adenosine receptor A3
Ligand
BDBM50372721
Substrate
Meas. Tech.
ChEMBL_465778 (CHEMBL931047)
Ki
398±n/a nM
Citation
 Jeong, LSLee, HWKim, HOTosh, DKPal, SChoi, WJGao, ZGPatel, ARWilliams, WJacobson, KAKim, HD Structure-activity relationships of 2-chloro-N6-substituted-4'-thioadenosine-5'-N,N-dialkyluronamides as human A3 adenosine receptor antagonists. Bioorg Med Chem Lett 18:1612-6 (2008)  
Target
Name:
Adenosine receptor A3
Synonyms:
A3 adenosine receptor (hA3) ADORA3 | Adenosine A3 receptor (A3AR)
Type:
G Protein-Coupled Receptor (GPCR)
Mol. Mass.:
36197.32
Organism:
Homo sapiens (Human)
Description:
P0DMS8
Residue:
318
  
Inhibitor
Name:
BDBM50372721
Synonyms:
CHEMBL272368
Type:
Small organic molecule
Emp. Form.:
C25H24ClIN6O3S
Mol. Mass.:
650.919
SMILES:
CCN(C(=O)[C@H]1S[C@H]([C@H](O)[C@@H]1O)n1cnc2c(NCc3cccc(I)c3)nc(Cl)nc12)c1ccccc1
: