Target
Sodium-dependent dopamine transporter
Ligand
BDBM50373032
Substrate
Meas. Tech.
ChEMBL_466324 (CHEMBL947041)
Ki
>6000±n/a nM
Citation
 Zeng, FJarkas, NStehouwer, JSVoll, RJOwens, MJKilts, CDNemeroff, CBGoodman, MM Synthesis, in vitro characterization, and radiolabeling of reboxetine analogs as potential PET radioligands for imaging the norepinephrine transporter. Bioorg Med Chem 16:783-93 (2008)  
Target
Name:
Sodium-dependent dopamine transporter
Synonyms:
DA transporter DAT1 Dopamine transporter protein (DAT) SC6A3_HUMAN Sodium-dependent dopamine transporter Solute carrier family 6 member 3
Type:
Multi-pass membrane protein
Mol. Mass.:
68497.11
Organism:
Homo sapiens (Human)
Description:
Q01959
Residue:
620
  
Inhibitor
Name:
BDBM50373032
Synonyms:
CHEMBL272003
Type:
Small organic molecule
Emp. Form.:
C18H21NO2S
Mol. Mass.:
315.43
SMILES:
CSc1ccccc1O[C@H]([C@@H]1CNCCO1)c1ccccc1
: