Target
Translocator protein
Ligand
BDBM22032
Substrate
Meas. Tech.
ChEMBL_466367 (CHEMBL932479)
IC50
2.1±n/a nM
Citation
 Cappelli, AGiuliani, GValenti, SAnzini, MVomero, SGiorgi, GSogliano, CMaciocco, EBiggio, GConcas, A Synthesis and structure-activity relationship studies in peripheral benzodiazepine receptor ligands related to alpidem. Bioorg Med Chem 16:3428-37 (2008)  
Target
Name:
Translocator protein
Synonyms:
Benzodiazepine receptors; peripheral & central Mbr PBR Peripheral benzodiazepine receptor (PBR) TSPO_RAT | Tspo
Type:
Mitochondrion membrane protein
Mol. Mass.:
18945.84
Organism:
Rattus norvegicus (rat)
Description:
Competitive binding experiments were performed on rat kidney mitochondrial membranes.
Residue:
169
  
Inhibitor
Name:
BDBM22032
Synonyms:
1-(2-chlorophenyl)-N-methyl-N-(1-methylpropyl)isoquinoline-3-carboxamide N-(butan-2-yl)-1-(2-chlorophenyl)-N-methylisoquinoline-3-carboxamide PK-11195 RP 52028 | [3H]PK 11195
Type:
radiolabeled ligand
Emp. Form.:
C21H21ClN2O
Mol. Mass.:
352.857
SMILES:
CCC(C)N(C)C(=O)c1cc2ccccc2c(n1)-c1ccccc1Cl
: