Target
Farnesyl pyrophosphate synthase
Ligand
BDBM12581
Substrate
Meas. Tech.
ChEMBL_466619 (CHEMBL924793)
Ki
331.4±n/a nM
Citation
 Dunford, JEKwaasi, AARogers, MJBarnett, BLEbetino, FHRussell, RGOppermann, UKavanagh, KL Structure-activity relationships among the nitrogen containing bisphosphonates in clinical use and other analogues: time-dependent inhibition of human farnesyl pyrophosphate synthase. J Med Chem 51:2187-95 (2008)  
Target
Name:
Farnesyl pyrophosphate synthase
Synonyms:
Dimethylallyltranstransferase FPP synthase FPPS_HUMAN Farnesyl diphosphate synthase Farnesyl diphosphate synthetase Farnesyl pyrophosphate synthetase KIAA1293 | P14324
Type:
Enzyme
Mol. Mass.:
48272.89
Organism:
Homo sapiens (Human)
Description:
P14324
Residue:
419
  
Inhibitor
Name:
BDBM12581
Synonyms:
(3-amino-1-hydroxy-1-phosphonopropyl)phosphonic acid CHEMBL834 | JMC515594 Compound 62
Type:
Small organic molecule
Emp. Form.:
C3H11NO7P2
Mol. Mass.:
235.0695
SMILES:
NCCC(O)(P(O)(O)=O)P(O)(O)=O
: