Target
Farnesyl pyrophosphate synthase
Ligand
BDBM50115106
Substrate
Meas. Tech.
ChEMBL_466619 (CHEMBL924793)
Ki
36.9±n/a nM
Citation
 Dunford, JEKwaasi, AARogers, MJBarnett, BLEbetino, FHRussell, RGOppermann, UKavanagh, KL Structure-activity relationships among the nitrogen containing bisphosphonates in clinical use and other analogues: time-dependent inhibition of human farnesyl pyrophosphate synthase. J Med Chem 51:2187-95 (2008)  
Target
Name:
Farnesyl pyrophosphate synthase
Synonyms:
Dimethylallyltranstransferase FPP synthase FPPS_HUMAN Farnesyl diphosphate synthase Farnesyl diphosphate synthetase Farnesyl pyrophosphate synthetase KIAA1293 | P14324
Type:
Enzyme
Mol. Mass.:
48272.89
Organism:
Homo sapiens (Human)
Description:
P14324
Residue:
419
  
Inhibitor
Name:
BDBM50115106
Synonyms:
2-(pyridin-2-ylamino)ethane-1,1-diyldiphosphonic acid [1-Phosphono-2-(pyridin-2-ylamino)-ethyl]-phosphonic acid(NE11808) [2-(2-pyridinylamino)ethylidene]-1,1-bisphosphonate | [2-(PYRIDIN-2-YLAMINO)ETHANE-1,1-DIYL]BIS(PHOSPHONIC ACID)
Type:
Small organic molecule
Emp. Form.:
C7H12N2O6P2
Mol. Mass.:
282.1275
SMILES:
OP(O)(=O)C(CNc1ccccn1)P(O)(O)=O
: