Target
Farnesyl pyrophosphate synthase
Ligand
BDBM50373098
Substrate
Meas. Tech.
ChEMBL_466619 (CHEMBL924793)
Ki
136.7±n/a nM
Citation
 Dunford, JEKwaasi, AARogers, MJBarnett, BLEbetino, FHRussell, RGOppermann, UKavanagh, KL Structure-activity relationships among the nitrogen containing bisphosphonates in clinical use and other analogues: time-dependent inhibition of human farnesyl pyrophosphate synthase. J Med Chem 51:2187-95 (2008)  
Target
Name:
Farnesyl pyrophosphate synthase
Synonyms:
Dimethylallyltranstransferase FPP synthase FPPS_HUMAN Farnesyl diphosphate synthase Farnesyl diphosphate synthetase Farnesyl pyrophosphate synthetase KIAA1293 | P14324
Type:
Enzyme
Mol. Mass.:
48272.89
Organism:
Homo sapiens (Human)
Description:
P14324
Residue:
419
  
Inhibitor
Name:
BDBM50373098
Synonyms:
CHEMBL259729
Type:
Small organic molecule
Emp. Form.:
C7H17NO7P2
Mol. Mass.:
289.1599
SMILES:
OC(CC1CCCCN1)(P(O)(O)=O)P(O)(O)=O
: