Target
Farnesyl pyrophosphate synthase
Ligand
BDBM50115104
Substrate
Meas. Tech.
ChEMBL_466620 (CHEMBL924794)
Ki
2.3±n/a nM
Citation
 Dunford, JEKwaasi, AARogers, MJBarnett, BLEbetino, FHRussell, RGOppermann, UKavanagh, KL Structure-activity relationships among the nitrogen containing bisphosphonates in clinical use and other analogues: time-dependent inhibition of human farnesyl pyrophosphate synthase. J Med Chem 51:2187-95 (2008)  
Target
Name:
Farnesyl pyrophosphate synthase
Synonyms:
Dimethylallyltranstransferase FPP synthase FPPS_HUMAN Farnesyl diphosphate synthase Farnesyl diphosphate synthetase Farnesyl pyrophosphate synthetase KIAA1293 | P14324
Type:
Enzyme
Mol. Mass.:
48272.89
Organism:
Homo sapiens (Human)
Description:
P14324
Residue:
419
  
Inhibitor
Name:
BDBM50115104
Synonyms:
(pyridin-2-ylamino)methylenediphosphonic acid 2-{[hydrogen phosphonato(phosphonato)methyl]amino}pyridin-1-ium [(2-pyridinylamino)methylene]-1,1-bisphosphonate [Phosphono-(pyridin-2-ylamino)-methyl]-phosphonic acid(NE11807)
Type:
Small organic molecule
Emp. Form.:
C6H10N2O6P2
Mol. Mass.:
268.1009
SMILES:
OP(O)(=O)C(Nc1ccccn1)P(O)(O)=O
: