Target
Farnesyl pyrophosphate synthase
Ligand
BDBM50079022
Substrate
Meas. Tech.
ChEMBL_466620 (CHEMBL924794)
Ki
29800±n/a nM
Citation
 Dunford, JEKwaasi, AARogers, MJBarnett, BLEbetino, FHRussell, RGOppermann, UKavanagh, KL Structure-activity relationships among the nitrogen containing bisphosphonates in clinical use and other analogues: time-dependent inhibition of human farnesyl pyrophosphate synthase. J Med Chem 51:2187-95 (2008)  
Target
Name:
Farnesyl pyrophosphate synthase
Synonyms:
Dimethylallyltranstransferase FPP synthase FPPS_HUMAN Farnesyl diphosphate synthase Farnesyl diphosphate synthetase Farnesyl pyrophosphate synthetase KIAA1293 | P14324
Type:
Enzyme
Mol. Mass.:
48272.89
Organism:
Homo sapiens (Human)
Description:
P14324
Residue:
419
  
Inhibitor
Name:
BDBM50079022
Synonyms:
HP2O7(3-) diphosphate(3-) | hydrogen diphosphate
Type:
Small organic molecule
Emp. Form.:
HO7P2
Mol. Mass.:
174.9529
SMILES:
OP([O-])(=O)OP([O-])([O-])=O
: