Target
Farnesyl pyrophosphate synthase
Ligand
BDBM50138725
Substrate
Meas. Tech.
ChEMBL_466620 (CHEMBL924794)
Ki
7.4±n/a nM
Citation
 Dunford, JEKwaasi, AARogers, MJBarnett, BLEbetino, FHRussell, RGOppermann, UKavanagh, KL Structure-activity relationships among the nitrogen containing bisphosphonates in clinical use and other analogues: time-dependent inhibition of human farnesyl pyrophosphate synthase. J Med Chem 51:2187-95 (2008)  
Target
Name:
Farnesyl pyrophosphate synthase
Synonyms:
Dimethylallyltranstransferase FPP synthase FPPS_HUMAN Farnesyl diphosphate synthase Farnesyl diphosphate synthetase Farnesyl pyrophosphate synthetase KIAA1293 | P14324
Type:
Enzyme
Mol. Mass.:
48272.89
Organism:
Homo sapiens (Human)
Description:
P14324
Residue:
419
  
Inhibitor
Name:
BDBM50138725
Synonyms:
(1-phosphono-2-pyridin-3-yl-ethyl)-phosphonic acid | CHEMBL98110
Type:
Small organic molecule
Emp. Form.:
C7H11NO6P2
Mol. Mass.:
267.1129
SMILES:
OP(O)(=O)C(Cc1cccnc1)P(O)(O)=O
: