Target
Farnesyl pyrophosphate synthase
Ligand
BDBM12579
Substrate
Meas. Tech.
ChEMBL_466620 (CHEMBL924794)
Ki
302.6±n/a nM
Citation
 Dunford, JEKwaasi, AARogers, MJBarnett, BLEbetino, FHRussell, RGOppermann, UKavanagh, KL Structure-activity relationships among the nitrogen containing bisphosphonates in clinical use and other analogues: time-dependent inhibition of human farnesyl pyrophosphate synthase. J Med Chem 51:2187-95 (2008)  
Target
Name:
Farnesyl pyrophosphate synthase
Synonyms:
Dimethylallyltranstransferase FPP synthase FPPS_HUMAN Farnesyl diphosphate synthase Farnesyl diphosphate synthetase Farnesyl pyrophosphate synthetase KIAA1293 | P14324
Type:
Enzyme
Mol. Mass.:
48272.89
Organism:
Homo sapiens (Human)
Description:
P14324
Residue:
419
  
Inhibitor
Name:
BDBM12579
Synonyms:
(1-hydroxy-2-phenyl-1-phosphonoethyl)phosphonic acid CHEMBL56556
Type:
Small organic molecule
Emp. Form.:
C8H12O7P2
Mol. Mass.:
282.1242
SMILES:
OC(Cc1ccccc1)(P(O)(O)=O)P(O)(O)=O
: