Target
Adenosylhomocysteinase
Ligand
BDBM50373102
Substrate
Meas. Tech.
ChEMBL_466721 (CHEMBL937442)
IC50
4510±n/a nM
Citation
 Ando, TIwata, MZulfiqar, FMiyamoto, TNakanishi, MKitade, Y Synthesis of 2-modified aristeromycins and their analogs as potent inhibitors against Plasmodium falciparum S-adenosyl-L-homocysteine hydrolase. Bioorg Med Chem 16:3809-15 (2008)  
Target
Name:
Adenosylhomocysteinase
Synonyms:
AdoHcyase S-adenosyl-L-homocysteine hydrolase | SAHH_PLAF7
Type:
PROTEIN
Mol. Mass.:
53833.80
Organism:
Plasmodium falciparum 3D7
Description:
ChEMBL_196715
Residue:
479
  
Inhibitor
Name:
BDBM50373102
Synonyms:
CHEMBL261619
Type:
Small organic molecule
Emp. Form.:
C11H16N6O3
Mol. Mass.:
280.2831
SMILES:
Nc1nc(N)c2ncn([C@@H]3C[C@H](CO)[C@@H](O)[C@H]3O)c2n1
: