Target
Glutamate receptor 3
Ligand
BDBM50373889
Substrate
Meas. Tech.
ChEMBL_468627 (CHEMBL934444)
Ki
1070±n/a nM
Citation
 Beich-Frandsen, MPickering, DSMirza, OJohansen, TNGreenwood, JVestergaard, BSchousboe, AGajhede, MLiljefors, TKastrup, JS Structures of the ligand-binding core of iGluR2 in complex with the agonists (R)- and (S)-2-amino-3-(4-hydroxy-1,2,5-thiadiazol-3-yl)propionic acid explain their unusual equipotency. J Med Chem 51:1459-63 (2008)  
Target
Name:
Glutamate receptor 3
Synonyms:
AMPA-selective glutamate receptor 3 GLURC GRIA3_HUMAN GluR-C Glutamate receptor 3 Glutamate receptor ionotropic, AMPA 3
Type:
PROTEIN
Mol. Mass.:
101172.14
Organism:
Homo sapiens (Human)
Description:
ChEMBL_468627
Residue:
894
  
Inhibitor
Name:
BDBM50373889
Synonyms:
CHEMBL402444
Type:
Small organic molecule
Emp. Form.:
C5H7N3O3S
Mol. Mass.:
189.192
SMILES:
N[C@H](Cc1ns[nH]c1=O)C(O)=O
: