Target
Histamine H3 receptor
Ligand
BDBM50374106
Substrate
Meas. Tech.
ChEMBL_468943 (CHEMBL930591)
Ki
67±n/a nM
Citation
 Santora, VJCovel, JAHayashi, RHofilena, BJIbarra, JBPulley, MDWeinhouse, MISengupta, DDuffield, JJSemple, GWebb, RRSage, CRen, APereira, GKnudsen, JEdwards, JESuarez, MFrazer, JThomsen, WHauser, EWhelan, KGrottick, AJ A new family of H3 receptor antagonists based on the natural product Conessine. Bioorg Med Chem Lett 18:1490-4 (2008)  
Target
Name:
Histamine H3 receptor
Synonyms:
HH3R Hrh3
Type:
G Protein-Coupled Receptor (GPCR)
Mol. Mass.:
48607.98
Organism:
Rattus norvegicus (rat)
Description:
Residue:
445
  
Inhibitor
Name:
BDBM50374106
Synonyms:
CHEMBL270439
Type:
Small organic molecule
Emp. Form.:
C25H30N2
Mol. Mass.:
358.5191
SMILES:
C(Cc1ccc(cc1)C1=CCC2CN(CC12)c1ccccc1)N1CCCC1
: