Target
Histamine H3 receptor
Ligand
BDBM50374108
Substrate
Meas. Tech.
ChEMBL_468943 (CHEMBL930591)
Ki
2.3±n/a nM
Citation
 Santora, VJCovel, JAHayashi, RHofilena, BJIbarra, JBPulley, MDWeinhouse, MISengupta, DDuffield, JJSemple, GWebb, RRSage, CRen, APereira, GKnudsen, JEdwards, JESuarez, MFrazer, JThomsen, WHauser, EWhelan, KGrottick, AJ A new family of H3 receptor antagonists based on the natural product Conessine. Bioorg Med Chem Lett 18:1490-4 (2008)  
Target
Name:
Histamine H3 receptor
Synonyms:
HH3R Hrh3
Type:
G Protein-Coupled Receptor (GPCR)
Mol. Mass.:
48607.98
Organism:
Rattus norvegicus (rat)
Description:
Residue:
445
  
Inhibitor
Name:
BDBM50374108
Synonyms:
CHEMBL273202
Type:
Small organic molecule
Emp. Form.:
C24H30N2
Mol. Mass.:
346.5084
SMILES:
CN(C)CCc1ccc(cc1)C1=CCC2CN(Cc3ccccc3)CC12
: